identifier,name,unique_name,key_bcci,key_bcci_2,key_bigbash,key_cricbuzz,key_cricheroes,key_crichq,key_cricinfo,key_cricinfo_2,key_cricingif,key_cricketarchive,key_cricketarchive_2,key_nvplay,key_nvplay_2,key_opta,key_opta_2,key_pulse,key_pulse_2
b4a23876,AAA Amsterdam,AAA Amsterdam,,,,,,,772407,,,,,,,,,,
482762af,AA Adeoye,AA Adeoye,,,,,,,380588,,,,,,,,,,
4b0e3049,AA Alleyne,AA Alleyne,,,,,,,661441,,,1512811,,,,,,18542,
fd3c5c00,AAA Patel,AAA Patel,,,,,,,1163136,,,,,,,,,,
bc005f0d,AAA White,AAA White,,,,,,,474307,,,,,,,,,,
5c67c7a6,AA Baig,AA Baig,,,,,,,524897,,,,,,,,,,
6a58e069,AA Bamal,AA Bamal,i0X1KhUIJLIzQOiJAiebGCiVyJJeiOc,,,,,,1123075,,,,,,,,,,
02d11602,AA Banner,AA Banner,,,,,,,590021,,,,,,,,,,
b690f34a,AA Barot,AA Barot,KVGiiAJbJeyiJCIeiXLzJ1OcO0UihIQ,,,,,,398519,,,,,,,,,,
c7a9ffbf,AA Bevilaqua,AA Bevilaqua,,,,,,,959617,,,,,,,,,,
bff458c6,AA Bilakhia,AA Bilakhia,,,,,,,26946,,,,,,,,,,
44e58b5b,AA Chakraborty,AA Chakraborty,0bcII1ihOXJJiQzCeLUiKiVOJAeyGJi,,,,,,680363,,,,,,,,,,
29d72eb2,AA Chavan,AA Chavan,,,,,,,337913,,,,,,,,,138,
b2c38dce,AA Choudhury,AA Choudhury,,,,,,,1339014,,,,,,,,,,
d37fd2c3,A Adams,A Adams,,,,,,,464322,,,,,,,,,,
1b0ce76e,A Adekunle,A Adekunle,,,,,,,1365288,,,,,,,,,,
cfa56623,AA Deshpande,AA Deshpande,,,,,,,220679,,,,,,,,,,
4c931d56,AA Donald,AA Donald,,,,,,,44716,,,2010,,,,,,,
9dbc77b3,Aaftab Alam Khan,Aaftab Alam Khan,,,,,,,1269467,,,,,,,,,,
a768a762,AA Gajic,AA Gajic,,,,,,,1323426,,,,,,,,,,
fa0d3636,AA Gordon,AA Gordon,,,,,,,909119,,,,,,,,,,
797f52cc,AAhan Achar,AAhan Achar,,,,,,,973793,1048889,,2034983,,,,,,,
4ed49d3d,AA Herwadkar,AA Herwadkar,IJXzQGIiAJJeLiOObhVcJK1i0iUyCie,,,,,,532851,,,,,,,,,1562,
55a5cffb,A Ahmadhel,A Ahmadhel,,,,,,,1203910,,,2322669,,,,,,,
60ef3ddb,AA Hussein,AA Hussein,,,,,,,1280685,,,,,,,,,,
007f121f,A Aikenhead,A Aikenhead,,,,,,,1378740,,,,,,,,,,
81782f5b,AAIP Bastari,AAIP Bastari,,,,,,,1181807,,,,,,,,,,
25c73eb6,A Aitken,A Aitken,,,,,,,306201,,,,,,,,,,
88626ed2,AA Jangoo,AA Jangoo,,,,,,,820681,,,1499315,,,,,,,
1fb04d31,AA Jasani,AA Jasani,,,,,,,637296,,,,,,,,,,
2815fe50,AA Jhunjhunwala,AA Jhunjhunwala,,,,,,,29702,,,,,,,,,284,
d912dd58,AA Kargave,AA Kargave,,,,,,,1273948,,,,,,,,,,
02f4b99c,Aakarshit Gomel,Aakarshit Gomel,1eOiAVIiyIGUJCLbOzhJJcie0iKJiXQ,,,,,,474782,,,,,,,,,,
279c51f0,Aakash Chand,Aakash Chand,,,,,,,1185557,,,,,,,,,,
24f5e41a,Aakash Verma,Aakash Verma,XJhJO1COJiAeGIIii0iJKUVbiQezLcy,,,,,,482293,,,,,,,,,,
16605a1b,AA Kazi,AA Kazi,e0cJh1QiOIJeILJAVUCzKyiJGOXbiii,,,,,,422106,,,,,,,,,,
14ea3348,A Amado,A Amado,,,,,,,1321182,,,,,,,,,,
8fa8c6e2,AA Mailey,AA Mailey,,,,,,,6465,,,376,,,,,,,
edb3df84,AA Mallett,AA Mallett,,,,,,,6472,,,1319,,,,,,,
ecc4562b,AAM Eliane,AAM Eliane,,,,,,,1276644,,,,,,,,,,
935678ee,Aamer Azmat,Aamer Azmat,,,,,,,1248374,,,,,,,,,,
161641cd,Aamer Ikram,Aamer Ikram,,,,,,,1204633,,,,,,,,,,
a8e54ef4,Aamer Jamal,Aamer Jamal,,,,,,,793441,,,,,,,,,,
97ef55d6,Aamer Malik,Aamer Malik,,,,,,,38965,,,1871,,,,,,,
7f8a923e,Aamer Nazir,Aamer Nazir,,,,,,,38966,,,2082,,,,,,,
f49079b8,Aamer Sohail,Aamer Sohail,,,,,,,38967,,,2031,,,,,,,
907d6e58,Aamer Yamin,Aamer Yamin,,,,,,,434429,,13732,251937,,,,,,2880,
f49989eb,Aamir Aziz,Aamir Aziz,hiOI0JJJJVAXQCLecOieiGIiiyz1bKU,,,,,,589136,,,,,,,,,,
2c3afa34,Aamir Gani,Aamir Gani,eiQJUcOiCJKiebVhAIJiy0J1OGzILiX,,,,,,642543,,,,,,,,,1557,
66f9ecc2,Aamir Javed,Aamir Javed,,,,,,,530197,,,,,,,,,,
7ecb9a14,Aamir Kaleem,Aamir Kaleem,,,,,,,455463,,,54674,,,,,,2824,
2472ad2c,Aamir Lal,Aamir Lal,,,,,,,1338631,,,,,,,,,,
80190078,AA Moiane,AA Moiane,,,,,,,1326685,,,,,,,,,,
82c528b2,AA Mulla,AA Mulla,,,,,,,23899,,,,,,,,,2671,
528a37ce,Aanand Pandey,Aanand Pandey,,,,,,,1263721,,,,,,,,,,
5c805a60,AA Navicha,AA Navicha,,,,,,,1155511,,,,,,,,,,
38a36999,A Andrew,A Andrew,,,,,,,530131,,,,,,,,,,
1d45c01a,A Andrews,A Andrews,,,,,,,1135751,,,,,,,,,,
e697d88c,A Andriani,A Andriani,,,,,,,1116777,,,,,,,,,,
b69e69ed,AA Noffke,AA Noffke,,,,,,,6938,,,,,,,,,,
71ee052e,Aanshul Gupta,Aanshul Gupta,hzVKiJQeGOiICJiIJi1yLAJeOibcXU0,,,,,,536792,,,,,,,,,,
7081491e,AA Obanda,AA Obanda,,,,,,,291844,,,,,,,,,1158,
409ce380,AA Onikoyi,AA Onikoyi,,,,,,,403321,,,,,,,,,,
96f5b685,AA Paradkar,AA Paradkar,,,,,,,1276396,,,,,,,,,,
7c1ba524,AA Patil,AA Patil,,,,,,,578451,,,,,,,,,567,
70d57519,AAP Atkinson,AAP Atkinson,,,,,,,1039481,,,1130431,,,,,,20477,
62479b4b,AA Premji,AA Premji,,,,,,,1089774,,,,,,,,,,
1911dcbc,AAP Rivero,AAP Rivero,,,,,3520831,,1193275,,,,,,,,,,
a95a9620,Aaqib Javed,Aaqib Javed,,,,,,,38970,,,1922,,,,,,,
d290c5b5,Aaqib Khan,Aaqib Khan,20170036b15dd36111e792a5028d29d,,,,,,1207680,,,,,,,,,,
b0b5d6ba,Aaqib Sulehri,Aaqib Sulehri,,,,,,,937959,,,,,,,,,,
2327fdc7,AA Rahayu,AA Rahayu,,,,,,,1409303,,,,,,,,,,
21d38d47,A Aravinddaraj,A Aravinddaraj,2018557c38a9d91611e8a30e02726df,,,,,,1175501,,,,,,,,,,
3f1bfd19,A Argyropoulou,A Argyropoulou,,,,,,,1333937,,,,,,,,,,
cd4d7695,Aarif Sheikh,Aarif Sheikh,,,,,,,701217,,,1588164,,,,3006,,3006,
b66201dd,Aarnav Patel,Aarnav Patel,,,,,,,1425319,,,,,,,,,,
eab74985,Aaron Beard,AP Beard,,,,,,,894103,,,1130531,,,,,,3482,
de8341fd,Aaron Campbell,Aaron Campbell,,,,,,,1269257,,,,,,,,,,
17aa4f1d,Aaron Jones,Aaron Jones,,,,,,,957645,,,969401,,,,17108,,,
67b99b43,A Arroz,A Arroz,,,,,,,1158412,,,,,,,,,,
8053c798,Aarya Desai,Aarya Desai,,,,,,,1353014,,,,,,,,,,
88be2a27,AA Sanguelkar,AA Sanguelkar,,,,,,,1213644,,,407081,,,,,,,
90a5e58a,AA Sanklecha,AA Sanklecha,VyGiiQeJ0CJIJiiAhU1OcJbKzieIOXL,,,,,,35292,,,,,,,,,,
8996a9a0,AA Sarwate,AA Sarwate,,,,,,,719717,,,,,,,,,,
ef7a904e,AA Shafique,AA Shafique,,,,,,,513005,,,,,,,,,,
1c2a64cd,A Ashish Reddy,A Ashish Reddy,VcQJi1U0OGJeCXKzibLiyhIAiJJIeOi,,,,,,389605,,,,,,,,,34,
321be7e3,A Ashok,A Ashok,,,,,,,1193546,,,,,0ad52976-7c00-4704-95a8-f6e267ec7646,,,,,
9244df4b,A Ashokan,A Ashokan,,,,,,,1156472,,,2243294,,,,,,,
42c41e1a,Aasif Iqbal,Aasif Iqbal,,,,,,,1141874,1241315,,,,,,,,,
dcbea954,Aasif Sheikh,Aasif Sheikh,,,,,,,1058514,,,,,,,,,,
72448ed4,A Askari,A Askari,,,,,,,1414169,,,,,,,,,,
94aa1697,AAS Silva,AAS Silva,,,,,,,229060,,,,,,,,,,
58c2fac4,A Athanaze,A Athanaze,,,,,,,1078692,,,,,,,,,,
fa62a463,A Awasthi,A Awasthi,,,,,,,1403178,,,,,,,,,,
d2d15439,Aayan Afzal Khan,Aayan Afzal Khan,,,,,,,1241265,,,,,,,,,,
a09eb585,A Ayre,A Ayre,,,,,,,333639,,,,,,,,,,
1cca37c8,A Bacher,A Bacher,,,,,,,44026,,,1271,,,,,,,
872b03f7,A Badoni,A Badoni,iUJeXIbiz1VGLe0iiJcIOJQCAKJhiOy,,,,,,1151270,,,,,,,,,,
112959b2,A Bagai,A Bagai,,,,,,,23797,,,,,,,,,1234,
fa463154,AB Agarkar,AB Agarkar,,,,,,,26184,,,7111,,,,,,47,
6ef13460,A Balbirnie,A Balbirnie,,,,,,,303423,,,128608,,,,,,1190,
f9607922,A Barnes,A Barnes,,,,,,,44049,,,,,,,,,,
4f62e07f,A Barty,A Barty,,,,,,,942629,,,,,,,,,,
d3a3e82d,AB Barath,AB Barath,,,,,,,274926,,,158039,,,,,,398,
2cec2a92,Abbas Afridi,Abbas Afridi,,,,,,,1158538,,,,,,,,,,
41ce15da,Abbas Ali Baig,Abbas Ali Baig,,,,,,,26817,,,1113,,,,,,,
a8f91f78,Abbas Ghani,Abbas Ghani,,,,,,,1390687,,,,,,,,,,
c3e77f52,Abbas Saad,Abbas Saad,,,,,,,362682,,,,,,,,,,
1760e2c7,AB Bhadoriya,AB Bhadoriya,,,,,,,1292716,,,,,,,,,,
57c81c1f,ABB Sangma,ABB Sangma,,,,,,,1403151,,,,,,,,,,
5f272b72,AB Chawla,AB Chawla,,,,,,,23939,,,,,,,,,,
dfdd7b97,Abdalah Lubega,Abdalah Lubega,,,,,,,522222,,,,,,,,,,
c4487b84,AB de Villiers,AB de Villiers,,,3241,,,,44936,,,45848,,,,,,233,
66b30f71,AB Dinda,AB Dinda,UG1IAQOiiJIiibeCJezyXOihcJJKV0L,,,,,,227712,,,,,,,,,48,
0251a22f,Abdul Bangalzai,Abdul Bangalzai,,,,,,,1199393,,,,,,,,,,
b6af1647,Abdul Bashir,Abdul Bashir,,,,,,,1380794,,,,,,,,,,
cc777ffa,Abdul Basith,Abdul Basith,,,,,,,1287067,,,,,,,,,,
8548e6ce,Abdul Ela Al Quraishi,Abdul Ela Al Quraishi,cOzQbGJIJyeCIehAJOJUii01XiiiKLV,,,,,,1287055,,,,,,,,,,
705a05c8,Abdul Halim,Abdul Halim,,,,,,,804055,,,,,,,,,2911,
10d94c90,Abdul Haq,Abdul Haq,,,,,,,447456,,,,,,,,,,
73b1db79,Abdul Hashim,Abdul Hashim,,,,,,,1062588,,,,,,,,,,
dc9d2e3c,Abdul Jabar,Abdul Jabar,,,,,,,633673,,,,,,,,,,
3f4b9ae5,Abdul Jabbar,Abdul Jabbar,,,,,,,313526,1193008,,,,,,,,,
2c29b16e,Abdul Jalali,Abdul Jalali,,,,,,,1101940,,,,,,,,,,
8f21593d,Abdul Kadir,Abdul Kadir,,,,,,,38971,,,1236,,,,,,,
6ef9a32f,Abdulla Bhoola,Abdulla Bhoola,,,,,,,1287102,,,,,,,,,,
5de198db,Abdullah Akbarjan,Abdullah Akbarjan,,,,,,,1198877,,,,,,,,,,
3731735d,Abdullah Akhunzada,Abdullah Akhunzada,,,,,,,437037,,,,,,,,,,
26ccdb37,Abdullah Al Mamun,Abdullah Al Mamun,,,,,,,56264,,,,,,,,,,
ea36b0ee,Abdullah Al Mamun,Abdullah Al Mamun (2),,,,,,,1277007,,,,,,,,,,
8ab49ad2,Abdullah Bayoumy,Abdullah Bayoumy,,,,,,,1337353,,,,,,,,,,
7d42816e,Abdullah Ghulam,Abdullah Ghulam,,,,,,,1093659,,,,,,,,,,
5a42db78,Abdullah Jasat,Abdullah Jasat,,,,,,,1159860,,,,,,,,,,
926c6d3c,Abdullah Mahmood,Abdullah Mahmood,,,,,,,1112200,,,,,,,,,,
4846ef98,Abdullah Mazari,Abdullah Mazari,,,,,,,390752,,,,,,,,,,
508fbec9,Abdullah Qureshi,Abdullah Qureshi,,,,,,,749497,,,,,,,,,,
c4ab9b94,Abdullah Rana,Abdullah Rana,,,,,,,1386878,,,,,,,,,,
fc2fffb5,Abdullah Shafique,Abdullah Shafique,,,,,,,922941,,,1668449,,,,,,4582,
71686118,Abdullah Shahid,Abdullah Shahid,,,,,,,386982,,,,,,,,,,
336a85f6,Abdullah Sheikh,Abdullah Sheikh,,,,,,,1156435,,,,,,,,,,
bc7d10b8,Abdullah Syed,Abdullah Syed,,,,,,,1059782,,,,,,,,,,
384cebed,Abdul Majid,Abdul Majid,,,,,,,1217275,,,2341392,,,,,,,
0cfb42b5,Abdul Majid Abbasi,Abdul Majid Abbasi,,,,,,,1361960,710767,,,,,,,,,
b3218c80,Abdul Malik,Abdul Malik,,,,,,,1059030,,,1736322,,,,,,,
e3fbe553,Abdulmalik Jabarkhel,Abdulmalik Jabarkhel,,,,,,,1271987,,,,,,,,,,
353e92b3,Abdul Manan,Abdul Manan,,,,,,,1156247,,,,,,,,,,
61a1cead,Abdul Mazid,Abdul Mazid,,,,,,,508442,,,,,,,,,,
e1ac7789,Abdul Muqeet,Abdul Muqeet,,,,,,,594394,,,,,,,,,,
37cb317b,Abdul Muqeet,Abdul Muqeet (2),,,,,,,1060304,,,,,,,,,,
db07c3e8,Abdul Nabi,Abdul Nabi,,,,,,,39370,,,,,,,,,,
6a88d66d,Abdul Naser Baluch,Abdul Naser Baluch,,,,,,,1318851,,,,,,,,,,
494a0503,Abdul Nasir,Abdul Nasir,,,,,,,1216919,,23724,2340901,,,,,,,
05c3780a,Abdul Nasir,Abdul Nasir (2),,,,,,,39014,,,,,,,,,,
35824e03,Abdul Qadir,Abdul Qadir,,,,,,,402205,,,,,,,,,,
0b1dadd2,Abdul Qadir Khan,Abdul Qadir Khan,,,,,,,38973,,,1538,,,,,,,
12f53be7,Abdul Rahman,Abdul Rahman,,,,,,,1048915,1325901,,,,,,,,,
5fd762d5,Abdul Rahman,Abdul Rahman Rahmani,,,,,,,819507,,,,,,,,,,
40431f63,Abdul Rahman,Mohammad Abdul Rahman,,,,,,,1269466,,,,,,,,,,
df2dde61,Abdulrahman Dashti,Abdulrahman Dashti,,,,,,,781107,,,,,,,,,,
a3379021,Abdul Rashid,Abdul Rashid,,,,,,,402207,,,,,,,,,,
6eb2fb00,Abdul Rashid Karim,Abdul Rashid Karim,,,,,,,1156424,,,,,,,,,,
390ff45b,Abdul Razzaq,Abdul Razzaq,,,,,,,39836,,,4172,,,,,,442,
505371c8,Abdul Rehman,Abdul Rehman (2),,,,,,,25580,,,,,,,,,,
365df3f9,Abdul Sadiq,Abdul Sadiq,,,,,,,913865,,,,,,,,,,
ff2dd5e4,Abdul Salam,Abdul Salam,,,,,,,1213774,,,,,,,,,,
8e514b4c,Abdul Samad,Abdul Samad,hicQGCIJAJiJiVKXbJLyU0Oii1OzIee,,,,,,1175485,,,1949202,,,,,,19352,
7b9b9aef,Abdul Shakoor,Abdul Shakoor,,,,,,,585100,,,,,,,,,,
d52b13a6,Abdul Shakoor,Abdul Shakoor (2),,,,,,,1198937,,,2310458,,,,,,,
e45810ed,Abdul-Shakoor Rahimzei,Abdul-Shakoor Rahimzei,,,,,,,1156489,,,2243258,,,,,,,
5f91b34e,Abdul Stanikzai,Abdul Stanikzai,,,,,,,1318791,,,,,,,,,,
23fa9ea9,Abdul Waheed,Abdul Waheed,,,,,,,402106,,,455881,,,,,,,
40aea524,Abdul Wahid,Abdul Wahid,,,,,,,1172281,,,2341382,,,,,,,
be7d715b,Abdul Wasi,Abdul Wasi,,,,,,,974173,,,2004015,,,,,,,
edaae5f4,Abdur Rahman Sudais,Abdur Rahman Sudais,,,,,,,335850,,,,,,,,,,
43b375d4,Abdur Rauf,Abdur Rauf,,,,,,,39084,,,18735,,,,,,,
888e32bf,Abdur Razzak,Abdur Razzak,,,,,,,56283,,,44524,,,,,,330,2691
d094e7d1,Abdur Rehman,Abdur Rehman,,,,,,,39091,,,10318,,,,,,854,
01396dc6,Abeera Waris,Abeera Waris,,,,,,,1306410,,,,,,,,,,
8067b378,Abeer Maryam,Abeer Maryam,,,,,,,1306445,,,,,,,,,,
ef618cab,A Begg,A Begg,,,,,,,1199198,,,,,,,,,,
9d87a319,A Beggs,A Beggs,,,,,,,1094719,,,,,,,,,,
c109497d,A Bengeri,A Bengeri,,,,,,,527897,,,,,,,,,,
2ccbf856,A Benjamin,A Benjamin,,,,,,,474209,,,,,,,,,,
047d293e,A Bester,A Bester,,,,,,,366042,,,,,,,,,,
875909c0,AB Fudadin,AB Fudadin,,,,,,,51866,,,61020,,,,,,,
a74bbdad,A Bhadauria,A Bhadauria,,,,,,,1263722,,,,,,,,,,
906ef9e5,A Bhagwat,A Bhagwat,,,,,,,1134974,,,,,,,,,,
e88f436c,A Bhandari,A Bhandari,,,,,,,26896,,,,,,,,,,
192f2caf,A Bhargava,A Bhargava,,,,,,,1329941,,,,,,,,,,
3cc96a05,A Bharwad,A Bharwad,,,,,,,1404554,,,,,,,,,,
2c2013a9,A Bhattarai,A Bhattarai,,,,,,,233409,,,,,,,,,,
778062fb,Abhay,Abhay,2018331c138ef16511e8a30e02726df,,,,,,1206027,,,,,,,,,,
481dd6dc,Abhay Negi,Abhay Negi,2017d6733e1fa99f11e78020028d29d,,,,,,1159789,,,,,,,,,,
b91083bd,Abhijeet Ahuja,Abhijeet Ahuja,,,,,,,1204125,,,,,,,,,,
5fd3f9db,Abhijeet Saket,Abhijeet Saket,2018a25b2b8ff69d11e79b5f028d29d,,,,,,1163686,,,,,,,,,,
59ec9638,Abhijit Bhattacharya,Abhijit Bhattacharya,,,,,,,733337,,,,,,,,,,
ef131544,Abhijit Roy,Abhijit Roy,GQ0eyiibCI1iJzOLVOiIKXcJhJUJeAi,,,,,,425955,,,,,,,,,,
89b748cf,Abhilasha Singh,Abhilasha Singh,,,,,,,1275232,,,,,,,,,,
ab922bd0,Abhilash Gogoi,Abhilash Gogoi,hiJi1JeiQ0XbIycUiKJGIOiJVCALzOe,,,,,,1206031,,,,,,,,,,
56fd4f68,Abhilash Mallick,Abhilash Mallick,ceCGbOJzhKieLiIAJUyJQiXiO0JV1Ii,,,,,,425937,,,,,,,,,,
539d9b74,Abhimanyu Chauhan,Abhimanyu Chauhan,OiQUiOeLJeGVIJJzciIhC10yKXbJiiA,,,,,,232307,,,,,,,,,,
c224c5ef,Abhimanyu Rana,Abhimanyu Rana,C0eUiOQIizehGiVXcyO1biAJKJIJJiL,,,,,,425913,,,,,,,,,,
f1a7f596,Abhinav Dixit,Abhinav Dixit,IiJ0iVJOezJiObKJchCyLiGUIAXeQi1,,,,,,1163697,,,,,,,,,,
0cb292b1,Abhinav Raman,Abhinav Raman,,,,,,,973797,,,,,,,,,,
2eca546a,Abhinav Srivastava,Abhinav Srivastava,2016b198bc0aad6211e6842a028d29d,,,,,,1287016,,,,,,,,,,
edf3773b,Abhiraj Singh,Abhiraj Singh,,,,,,,402096,,,,,,,,,,
f4cd319e,Abhisek Das,Abhisek Das,iOJGbIiiLJyVJUzOKAQeIX0e1iJihcC,,,,,,625374,,,,,,,,,,
65cf74b4,Abhishek Ahuja,Abhishek Ahuja,,,,,,,1204126,,,,,,,,,,
18953b31,Abhishek Bhandari,Abhishek Bhandari,OJiiXcAGbeVJzIyLJOIiiQCUJKihe01,,,,,,1175432,,,,,,,,,,
53c5c146,Abhishek Goswami,Abhishek Goswami,eUXyiAieILIJOiJK0COiQbciGJVhJz1,,,,,,1081436,,,,,,,,,,
22a2a635,Abhishek Gupta,Abhishek Gupta,bULJKIziJGieiJAOiICy1eOhVXcQi0J,,,,,,801929,,,,,,,,,,
cdc4604c,Abhishek Mohan,Abhishek Mohan,zJQCeiiiUheJAOiVIOy1KXbcGiJILJ0,,,,,,554159,,,,,,,,,,
8bf38500,Abhishek Pandey,Abhishek Pandey,VO1cIziQKeOCihJJXiyiJJieGUAIL0b,,,,,,1246444,,,,,,,,,,
43d1ee59,Abhishek Raman,Abhishek Raman,LJ1iXhOybiVGiKeJUzAeic0OiIIJQCJ,,,,,,1069497,,,,,,,,,,
a92a9292,Abhishek Sakuja,Abhishek Sakuja,CXLKcOJViUbiJzQJeehOiiGJiI0yI1A,,,,,,339958,,,,,,,,,,
f29185a1,Abhishek Sharma,Abhishek Sharma,i0IJLJ1GJOycQAVzCeheiUbXiiIOKJi,JiKiGIeIUAV0hzOiiLQJ1XycCJbJOei,,,,,1070183,1131614,,1576635,,,,,,3760,
c8ded7bc,Abhishek Tanwar,Abhishek Tanwar,iyOICJJKi0ehAVJiQLiIGXOezJ1cibU,,,,,,714479,,,,,,,,,,
ff9c2522,Abhishek Thakuri,Abhishek Thakuri,ibi0XCeIVJIcUKJAGQ1OJOiyiehJLzi,,,,,,1126196,,,,,,,,,,
bca46fdb,Abhishek Yadav,Abhishek Yadav,KIAihCQJ0IJJGb1ciLViXOeiUziyeOJ,,,,,,955087,,,,,,,,,,
414c497b,AB Holder,AB Holder,,,,,,,1124285,,,,,,,,,,
7873b849,AB Howard,AB Howard,,,,,,,52067,,,1388,,,,,,,
5d836a72,Abid Ali,Abid Ali,,,,,,,39950,,15886,69429,,,,,,5314,
bdac9f0f,A Bidari,A Bidari,,,,,,,1171735,,,,,,,,,,
f9979b69,Abid Mushtaq,Abid Mushtaq,,,,,,,484045,,,,,,,,,,
b10e8c85,Abid Mushtaq,Abid Mushtaq (2),AeIhVQyXJiiibJ1iIceLJJzUO0KCGOi,,,,,,1201536,,,,,,,,,,
b51d654f,A Bierwisch,A Bierwisch,,,,,,,1190581,,,2239794,,,,,,,
ad3b6e95,Abishek Porel,Abishek Porel,,,,,,,1277545,,,,,,,,,,
376557f7,A Bishnoi,A Bishnoi,,,,,,,1268920,,,,,,,,,,
ee866f8d,A Bisson,A Bisson,,,,,,,303840,,,,,,,,,,
3951be49,AB Kamara,AB Kamara,,,,,,,346552,,,,,,,,,,
9565fda6,AB Kaur,AB Kaur,,,,,,,1255411,,,,,,,,,,
4095f16b,AB Kookna,AB Kookna,eiC1LheJizIKQi0ViOJybAIOiXUJJGc,,,,,,,,,,,,,,,,
c0ac45da,AB London,AB London,,,,,,,258556,,,,,,,,,,
16043342,AB McDonald,AB McDonald,,,,,,,6553,,,9179,,,,,,234,
8ad3d034,AB Mengoumou,AB Mengoumou,,,,,,,1286503,,,,,,,,,,
64fb6b15,A Bohara,A Bohara,,,,,,,1058508,,,2250583,,,,5495,,,
71c1f483,A Bonora,A Bonora,,,,,,,296136,,,,,,,,,,
dcf0e8f4,A Bosch,A Bosch,,,,,,,482506,,,,,,,,,17103,
b6f61482,A Bose,A Bose,,,,,,,1213656,,,2336870,,,,,,,
8a3c4af3,AB Perrin,AB Perrin,,,,,,,943419,,,,,,,,,,
684dc2da,Abraash Khan,Abraash Khan,,,,,,,650561,,,,,,,,,,
eca0c288,A Bramble,A Bramble,,,,,,,480693,,,452624,,,,,,,
abb7c76c,Abrar Ahmed,Abrar Ahmed,,,,,,,734459,,,,,,,,,,
6ddaee2d,Abrar Bilal,Abrar Bilal,,,,,,,1198872,,,,,,,,,,
053dc208,A Brindle,A Brindle,,,,,,,53820,,,,,,,,,546,
4157fefb,A Brown,A Brown,,,,,,,9249,,,1156,,,,,,,
9e866d80,A Brown-Carrera,A Brown-Carrera,,,,,,,1313545,,,,,,,,,,
91cf746e,Absar Khan,Absar Khan,,,,,,,1283168,,,,,,,,,,
4ae7048b,AB Slebsager,AB Slebsager,,,,,,,1302777,,,,,,,,,,
12dff268,AB Tancred,AB Tancred,,,,,,,47521,,,129,,,,,,,
0ec45a9a,Abubacarr Kuyateh,Abubacarr Kuyateh,,,,,,,1143150,,,,,,,,,,
31803fac,Abu Hider,Abu Hider,,,,,,,550137,,,,,,,,,1590,
1bb0993e,Abu Jayed,Abu Jayed,,,,,,,410763,,,484898,,,,,,3715,
f7cb7c3a,Abul Farhad,Abul Farhad,,,,,,,1230636,,,,,,,,,,
5c756df3,Abul Hasan,Abul Hasan,,,,,,,373439,,,366422,,,,,,493,
16f4cc7e,A Bulow,A Bulow,,,,,,,417263,,,,,,,,,,
1387be20,A Burdett,A Burdett,,,,,,,490953,,,,,,,,,,
2d645c00,A Bushell,A Bushell,,,,,,,526120,,,,,,,,,,
27f77bd6,Abu Zar,Abu Zar,,,,,,,271996,,,,,,,,,,
bc82e1b2,AB Williams,AB Williams,,,,,,,53228,,,1562,,,,,,,
a2421394,AC Agar,AC Agar,,,5358,,,,505120,,,1061470,,,,,,935,
4b788e61,A Campbell,A Campbell,,,,,,,1007861,,,,,,,,,,
ffd5fcd8,A Canning,A Canning,,,,,,,1229015,,,,,,,,,,
910dd54e,A Capsey,A Capsey,,,,,,,1187120,,,,,,,,,,
6fe2c1c0,A Carter,A Carter,,,,,,,297595,,,,,,,,,,
5e3f2522,A Cassim,A Cassim,,,,,,,1013209,,,,,,,,,,
ed282cc2,A Cawley,A Cawley,,,,,,,1112205,,,,,,,,,,
8a6c2263,AC Bannerman,AC Bannerman,,,,,,,4089,,,28,,,,,,,
0d352971,ACB Langton,ACB Langton,,,,,,,46132,,,657,,,,,,,
1efb8a28,AC Blizzard,AC Blizzard,,,,,,,4498,,,,,,,,,205,
d8e79af0,AC Botha,AC Botha,,,,,,,44102,,,,,,,,,2605,
2528611f,AC Boyce,AC Boyce,,,,,,,380928,,,,,,,,,,
95569cde,AC Brodin,AC Brodin,,,,,,,1268907,,,,,,,,,,
ad75edc3,AC Cummins,AC Cummins,,,,,,,51488,,,2075,,,,,,2398,
1c7fa06c,AC Dale,AC Dale,,,,,,,4890,,,5559,,,,,,,
62decd8e,AC Dawson,AC Dawson,,,,,,,44682,,,3964,,,,,,,
f86ce673,AC Douglas,AC Douglas,,,,,,,679551,,,,,,,,,,
e9a870ed,AC Evans,AC Evans,,,,,,,399259,,,,,,,,,1185,
7f74b21d,ACF Stokes,ACF Stokes,,,,,,,1036525,,,1515028,,,,,,,
916508da,ACF Wyatt,ACF Wyatt,,,,,,,395862,,,,,,,,,,
2b6e6dec,AC Gilchrist,AC Gilchrist,,,,,,,5390,,,4170,,,,,,65,
78fa5f6d,A Chandel,A Chandel,,,,,,,1341621,,,,,,,,,,
99b202b3,A Chandila,A Chandila,,,,,,,27783,,,,,,,,,273,
ef14c0ec,AC Harris,AC Harris,,,,,,,516692,,,,,,,,,,
c144a09d,A Chatterjee,A Chatterjee,,,,,,,27818,,,,,,,,,,
f52fbc63,A Chaudary,A Chaudary,,,,,,,278086,,,,,,,,,,
ffead9c2,A Chaudhary,A Chaudhary,,,,,,,307813,,,,,,,,,,
465fd722,A Chaudhary,Aryaveer Chaudhary,,,,,,,1329997,,,,,,,,,,
e62b4c77,A Chetty,A Chetty,,,,,,,294853,,,,,,,,,,
a0d07fd6,A Chilia,A Chilia,,,,,,,1093531,,,,,,,,,,
95f2b15b,Achit Shigwan,Achit Shigwan,eCLKiy0IObGQOeJiIiAXVUJihJJi1cz,,,,,,1131623,,,,,,,,,,
e249fdaa,A Chopra,A Chopra,,,,,,,27639,,,7749,,,,,,,
57a7b064,A Chopra,Anjum Chopra,,,,,,,53910,,,8475,,,,,,,
18e6906e,A Choudhary,A Choudhary,ViXyQh1zbiJJJUIeLOAKeiGiIicOCJ0,,,,,,527299,,,,,,,,,1111,
55a6eb86,AC Hudson,AC Hudson,,,,,,,45458,,,2011,,,,,,,
b9964982,ACI Lock,ACI Lock,,,,,,,55560,,,2223,,,,,,,
2372b3ad,ACI Lovell,ACI Lovell,,,,,,,1183957,,,,,,,,,,
2455b2d7,A Ciric,A Ciric,,,,,,,1331986,,,,,,,,,,
ac56b5a7,AC Jayangani,AC Jayangani,,,,,,,318853,,,303894,,,,,,600,
7673c908,AC Kerr,AC Kerr,,,11091,,,,803971,,,1753217,,,,,,3756,
23c38aa6,A Clark,A Clark,,,,,,,297892,,,,,,,,,,
8c73cd16,A Clark,Amy Clark,,,,,,,1385362,,,,,,,,,,
9417b5b6,A Clarke,A Clarke,,,,,,,1230753,,,,,,,,,,
8f9c5014,AC Lenham,AC Lenham,,,,,,,1260072,,,,,,,,,,
a3d329d7,ACL Richards,ACL Richards,,,,,,,52918,,,,,,,,,,
d58ef4b7,AC Mace-Cochrane,AC Mace-Cochrane,,,,,,,701739,,,1580567,,,,,,,
7cef11e4,AC MacLaren,AC MacLaren,,,,,,,16871,,,177,,,,,,,
956887b2,AC McDermott,AC McDermott,,,,,,,333810,,,,,,,,,,
db873292,AC Mushangwe,AC Mushangwe,,,,,,,922493,,,,,,,,,,
9cb022df,A Codrington,A Codrington,,,,,,,23848,,,,,,,,,,
6574768e,A Coningham,A Coningham,,,,,,,4611,,,180,,,,,,,
97b9cb64,A Conteh,A Conteh,,,,,,,346649,,,,,,,,,,
ef160d73,A Cossa,A Cossa,,,,,,,1158413,,,,,,,,,,
06face31,A Cotter,A Cotter,,,,,,,4632,,,277,,,,,,,
ff111ad7,A Coxon,A Coxon,,,,,,,10850,,,827,,,,,,,
749316d2,AC Parore,AC Parore,,,,,,,38117,,,1970,,,,,,,
ea5a4563,A Crafford,A Crafford,,,,,,,44670,,,,,,,,,,
b9a52291,A Cranstone,A Cranstone,,,,,,,517573,,,,,,,,,,
9df3a2f4,ACR Birch,ACR Birch,,,,,,,44413,,,,,,,,,,
dd45b04b,AC Sabino,AC Sabino,,,,,,,1339870,,,,,,,,,,
96cc6866,AC Smith,AC Smith,,,,,,,20222,,,1194,,,,,,,
ddae3cd2,AC Smith,Asha Smith,,,,,,,420311,,,,,,,,,,
ef08e047,ACS Pigott,ACS Pigott,,,,,,,18533,,,1747,,,,,,,
a839a4b7,AC Stanacu,AC Stanacu,,,,,,,1331987,,,,,,,,,,
964c881f,AC Stockwell,AC Stockwell,,,,,,,231309,,,,,,,,,,
b552a935,AC Thomas,AC Thomas,,,,,,,47569,,,,,,,,,216,
c32a41ba,A Curr,A Curr,,,,,,,1064533,,,,,,,,,,
864c199e,AC Voges,AC Voges,,,,,,,8119,,,12201,,,,,,400,
7dd70cda,AC Waller,AC Waller,,,,,,,55840,,,1885,,,,,,,
de84588e,AC Warren,AC Warren,,,,,,,210346,,,,,,,,,,
b1c113d7,Ada Bhasin,Ada Bhasin,,,,,,,1320240,,,,,,,,,,
397462b9,A Dagar,A Dagar,,,,,,,859423,,,,,,,,,,
a2b35d9b,A Dale,A Dale,,,,,,,11790,,,,,,,,,,
020e49e9,AD Algar,AD Algar,,,,,,,1156618,,,2276158,,,,,,,
66498395,A Dalzell,A Dalzell,,,,,,,1229005,,,,,,,,,,
e45ac860,Adama Kamara,Adama Kamara,,,,,,,1158423,,,,,,,,,,
0cabf6f4,Adam Birss,Adam Birss,,,,,,,1339348,,,,,,,,,,
96ff4de0,Adam Khalaf,Adam Khalaf,,,,,,,1418677,,,,,,,,,,
5b16a806,A Dananjaya,A Dananjaya,,,,,,,574178,,,515118,,,,,,588,
9e3f1cc4,A Daniel,A Daniel,,,,,,,1162381,,,,,,,,,,
8479657a,A Das,A Das,,,,,,,372319,,,,,,,,,,
4cc200ec,A Dastgir,A Dastgir,,,,,,,1275239,,,,,,,,,,
2f949d55,A Daxini,A Daxini,,,,,,,1382802,,,,,,,,,,
1b0a9d66,A Day,A Day,,,,,,,1171104,,,,,,,,,,
278b5e2b,AD Brown,AD Brown,,,,,,,9246,,,,,,,,,,
c3f4dc55,AD Carr,AD Carr,,,,,,,469880,,,,,,,,,,
40737b8d,AD Chopra,AD Chopra,,,,,,,1403162,,,,,,,,,,
6926f6db,AD Conwana,AD Conwana,,,,,,,1155502,,,,,,,,,,
3a4d914f,A Dcosta,A Dcosta,,,,,,,1306424,,,,,,,,,,
045fe562,AD Curtis,AD Curtis,,,,,,,11499,,,,,,,,,,
4255615e,AD Day,AD Day,,,,,,,814943,,,,,e4ce2511-a000-49cb-be36-ffd4cc44508b,,,,,
95389a96,AD de Lange,AD de Lange,,,,,,,262438,,,,,,,,,,
cdaf93fc,Adeel Malik,Adeel Malik,,,,,,,39905,,,,,,,,,,
79004151,Adeel Raja,Adeel Raja,,,,,,,24978,,,,,,,,,2675,
a421a9c5,Adel Kolasangiani,Adel Kolasangiani,,,,,,,1217431,,,2341430,,,,,,,
72b95896,A Dennison,A Dennison,,,,,,,526444,,,,,,,,,2980,
96912eac,A Denuwan,A Denuwan,,,,,,,1343338,,,,,,,,,,
d2b1f515,A Dercksen,A Dercksen,,,,,,,1163087,,,,,,,,,,
6fda55cc,A Deshmukh,A Deshmukh,,,,,,,412593,,,,,,,,,,
4d11f9c2,AD Evans,AD Evans,,,,,,,438273,,,,,,,,,,
1f77cf82,AD Gaekwad,AD Gaekwad,,,,,,,28754,,,1438,,,,,,,
4700f66f,ADG Matthews,ADG Matthews,,,,,,,16942,,,702,,,,,,,
cc5416c1,ADG Roberts,ADG Roberts,,,,,,,38253,,,1492,,,,,,,
92aeac25,AD Hales,AD Hales,,,4150,,,,249866,,11252,113074,,,,,,511,
753ada66,A Dhingra,A Dhingra,,,,,,,1275733,,,,,,,,,,
b62aea3c,Adhip Pradhan,Adhip Pradhan,,,,,,,543897,,,,,,,,,,
94759472,Adhitya Shetty,Adhitya Shetty,,,,,,,1241218,,,,,,,,,,
23f222d5,Adil Afzal,Adil Afzal,,,,,,,1156609,,,,,,,,,,
87addb93,Adil Amin,Adil Amin,,,,,,,384530,,15512,115128,,,,,,,
fb4c5ea5,Adil Bhatti,Adil Bhatti,,,,,,,552880,,,,,,,,,,
598f5484,Adil Butt,Adil Butt,,,,,,,1217293,,,2341383,,,,,,,
fde53ec1,Adil Butt,Adil Butt (2),,,,,,,1347279,,,,,,,,,,
396100de,Adil Hanif,Adil Hanif,,,,,,,39100,,,,,,,,,,
8d4653f3,Adil Reshi,Adil Reshi,czJJCVeeOiJiiQAKOJIGiXUihIby01L,,,,,,339956,,,,,,,,,,
42b0cc96,A Dineshi,A Dineshi,,,,,,,1390771,,,,,,,,,,
b6b1155c,Aditya,Aditya,2019574c891529e011e9a30e02726df,,,,,,1176088,,,,,,,,,,
8e02f42b,Aditya Garhwal,Aditya Garhwal,IiiUy0CAezOiiJ1LJeXbicQIKhOJVJG,,,,,,725435,,,,,,,,,,
c0c4b2e9,Aditya Jadeja,Aditya Jadeja,,,,,,,1300584,,,,,,,,,,
9a2d95ac,Aditya Kaushik,Aditya Kaushik,IILAJXVJKUbCiGiieyhJOJizQiO0e1c,,,,,,735835,,,,,,,,,,
77e321db,Aditya Panwar,Aditya Panwar,,,,,,,1400311,,,,,,,,,,
56182069,Aditya Rout,Aditya Rout,2016324322c7b3c511e6842a028d29d,,,,,,1247318,,,,,,,,,,